{"text_format":"1","workbook":"xlsx","n_sheets":7,"sheets":["Записка","Смета","Инструкция по заполнению","Списки","Согласование ЦБ","Структура","Должности"],"not_rendered":{"charts":0,"images":0,"macros":1,"external_links":10,"defined_names":56,"comments":0,"pivot_tables":0},"unopened":[],"bounds":{"document_bytes":16777216,"sheet_cells":100000,"rows_first":2000,"rows_last":500,"rows_between":2000,"halvings":0,"cell_chars":16384,"cell_head_chars":4096},"cells_cut":0,"cells_raw":0,"read":"whole","date_system":"1900"}

{"sheet":"Записка","index":0,"n_rows":50,"n_cols":6,"rows_kept":50,"cut":false,"hidden":false,"merged":[[49,4,49,5],[4,0,4,5],[6,3,18,3],[6,4,18,4],[6,5,18,5],[7,0,12,0],[13,0,18,0],[36,1,36,5],[39,1,39,5],[34,1,34,5],[13,1,13,2],[44,4,44,5],[28,2,28,5],[35,2,35,5],[24,0,25,0],[24,2,24,3],[47,4,47,5],[22,0,22,1],[29,2,29,5],[0,3,0,5],[6,1,6,2],[15,1,15,2],[23,1,23,5],[17,1,17,2],[18,1,18,2],[14,1,14,2],[16,1,16,2],[19,0,21,0],[30,2,30,5],[27,2,27,5],[31,2,31,5],[32,2,32,5],[25,2,25,3],[24,4,24,5],[25,4,25,5],[26,2,26,5],[46,4,46,5],[45,4,45,5],[33,1,33,5],[40,1,40,5],[41,1,41,5],[42,1,42,5],[38,4,38,5],[38,2,38,3],[37,1,37,5]]}
[null,null,null,"УТВЕРЖДАЮ"]
["Табельный номер",null,null,"Проректор"]
[null,null,null,"Простаков И.В."]
[null,null,"                                           ","подпись"]
["Служебная записка о командировании №                      от "]
[{"$f":"IF(B7=\"\",\"УКАЖИТЕ ФИО!\",\"\")","v":"УКАЖИТЕ ФИО!"}]
["ФИО (полностью) в именительном падеже",null,null,"Дата начала командировки","Дата окончания командировки","Продолжительность командировки, дней"]
["Наименование структурного подразделения (выберите из списка нажатием стрелки у правой ячейки)",null,{"$f":"IF(B8=\"\",\"\",VLOOKUP(B8,Структура!A:C,2,FALSE))","v":""}]
[null,null,{"$f":"IF(B9=\"\",\"\",VLOOKUP(B9,Структура!A:C,2,FALSE))","v":""}]
[null,null,{"$f":"IF(B10=\"\",\"\",VLOOKUP(B10,Структура!A:C,2,FALSE))","v":""}]
[null,null,{"$f":"IF(B11=\"\",\"\",VLOOKUP(B11,Структура!A:C,2,FALSE))","v":""}]
[null,null,{"$f":"IF(B12=\"\",\"\",VLOOKUP(B12,Структура!A:C,2,FALSE))","v":""}]
[null,null,{"$f":"IF(B13=\"\",\"\",VLOOKUP(B13,Структура!A:C,2,FALSE))","v":""}]
["Должность (выберите из списка)"]
[]
{"$rows_left_out":36}
{"sheet":"Смета","index":1,"n_rows":46,"n_cols":9,"rows_kept":46,"cut":false,"hidden":false,"merged":[[44,0,44,7],[45,0,45,7],[38,0,38,7],[39,0,39,7],[40,0,40,7],[41,0,41,7],[42,0,42,7],[34,0,34,7],[35,0,35,7],[36,0,36,7],[37,0,37,7],[43,0,43,7],[0,7,0,8],[1,1,1,8],[25,1,25,4],[25,5,25,8],[31,0,31,7],[28,0,28,8],[27,0,27,8],[20,2,20,4],[21,2,21,4],[22,2,22,4],[23,2,23,4],[24,2,24,4]]}
[null,null,null,null,null,null,null,"Приложение №1 \nк Положению о служебных командировках НИУ ВШЭ. Часть 2."]
[null,"Смета командировки"]
[null,{"$f":"Записка!$B$7","v":0}]
["п/п","Назначение","КВР",null,"валюта","Стоимость","Продолжительность","Сумма","Кодировка источника финансирования (заполняется работниками ПФУ)"]
[1,"Суточные (кроме дня возвращения). Страна 1",212,{"$f":"IF(E5=\"\",\"\",IF(COUNTIF(E$4:E5,E5)=1,MAX(D$4:D4)+1,\"\"))","v":""},{"$f":"IF(Записка!B20=\"\",\"\",VLOOKUP(Записка!B20,Списки!W$2:Y$229,2,FALSE))","v":""},{"$f":"IF(E5=\"\",0,IF(OR(Записка!C$36=\"Все расходы\",Записка!B$36=Списки!L20,Записка!C$36=Списки!L17,Записка!C$36=Списки!L29,Записка!C$36=Списки!L30,Записка!C$36=Списки!L31,Записка!C$36=Списки!L32),0,IF(Записка!B20=\"Российская Федерация\",VLOOKUP(Записка!B$36,Списки!L$2:N$28,2,FALSE)*700,VLOOKUP(Записка!B$36,Списки!L$1:N$28,3,FALSE)*VLOOKUP(Записка!B20,Списки!W$2:Y$217,3,FALSE))))","v":0},{"$f":"IF(Записка!F23=\"\",0,IF(F6=0,Записка!F20-1,Записка!F20))","v":0},{"$f":"IF(E5=\"\",0,F5*G5)","v":0}]
[null,"Суточные (кроме дня возвращения). Страна 2",212,{"$f":"IF(E6=\"\",\"\",IF(COUNTIF(E$4:E6,E6)=1,MAX(D$4:D5)+1,\"\"))","v":""},{"$f":"IF(Записка!B21=\"\",\"\",VLOOKUP(Записка!B21,Списки!W$2:Y$229,2,FALSE))","v":""},{"$f":"IF(E6=\"\",0,IF(OR(Записка!C$36=\"Все расходы\",Записка!B$36=Списки!L21,Записка!C$36=Списки!L18,Записка!C$36=Списки!L30,Записка!C$36=Списки!L31,Записка!C$36=Списки!L32,Записка!C$36=Списки!L33),0,IF(Записка!B21=\"Российская Федерация\",VLOOKUP(Записка!B$36,Списки!L$2:N$28,2,FALSE)*700,VLOOKUP(Записка!B$36,Списки!L$1:N$28,3,FALSE)*VLOOKUP(Записка!B21,Списки!W$2:Y$217,3,FALSE))))","v":0},{"$f":"IF(F6=0,0,IF(F7=0,Записка!F21-1,Записка!F21))","v":0},{"$f":"IF(E6=\"\",0,F6*G6)","v":0}]
[null,"Суточные (кроме дня возвращения). Страна 3",212,{"$f":"IF(E7=\"\",\"\",IF(COUNTIF(E$4:E7,E7)=1,MAX(D$4:D6)+1,\"\"))","v":""},{"$f":"IF(Записка!B22=\"\",\"\",VLOOKUP(Записка!B22,Списки!W$2:Y$229,2,FALSE))","v":""},{"$f":"IF(E7=\"\",0,IF(OR(Записка!C$36=\"Все расходы\",Записка!B$36=Списки!L22,Записка!C$36=Списки!L19,Записка!C$36=Списки!L31,Записка!C$36=Списки!L32,Записка!C$36=Списки!L33,Записка!C$36=Списки!L34),0,IF(Записка!B22=\"Российская Федерация\",VLOOKUP(Записка!B$36,Списки!L$2:N$28,2,FALSE)*700,VLOOKUP(Записка!B$36,Списки!L$1:N$28,3,FALSE)*VLOOKUP(Записка!B22,Списки!W$2:Y$214,3,FALSE))))","v":0},{"$f":"IF(F7=0,0,Записка!F22-1)","v":0},{"$f":"IF(E7=\"\",0,F7*G7)","v":0}]
[2,"Суточные (день возвращения)",212,{"$f":"IF(E8=\"\",\"\",IF(COUNTIF(E$4:E8,E8)=1,MAX(D$4:D7)+1,\"\"))","v":1},"Рубли",{"$f":"IF(Записка!F23=\"\",0,700)","v":0},{"$f":"IF(Записка!F23=\"\",0,1)","v":0},{"$f":"F8*G8","v":0}]
[3,"Проезд",212,{"$f":"IF(E9=\"\",\"\",IF(COUNTIF(E$4:E9,E9)=1,MAX(D$4:D8)+1,\"\"))","v":""},null,"X","X"]
[4,"Трансферт аэропорт-отель-аэропорт",212,{"$f":"IF(E10=\"\",\"\",IF(COUNTIF(E$4:E10,E10)=1,MAX(D$4:D9)+1,\"\"))","v":""},null,"X","X"]
[5,"Проживание. Страна 1",212,{"$f":"IF(E11=\"\",\"\",IF(COUNTIF(E$4:E11,E11)=1,MAX(D$4:D10)+1,\"\"))","v":""},{"$f":"IF(Записка!B20=\"\",\"\",VLOOKUP(Записка!B20,Списки!F$2:H$214,2,FALSE))","v":""},{"$f":"IF(E11=\"\",\"\",IF(OR(Записка!B$36=Списки!L25,Записка!C$36=Списки!L13,Записка!C$36=Списки!L14,Записка!C$36=Списки!L15,Записка!C$36=Списки!L16,Записка!C$36=Списки!L17,Записка!C$36=Списки!L18),0,VLOOKUP(Записка!B20,Списки!F$2:H$214,3,0)))","v":""},{"$f":"IF(Записка!F23=\"\",0,IF(E12=\"\",Записка!F20-1,Записка!F20))","v":0},{"$f":"IF(F11=\"\",0,F11*G11)","v":0}]
[null,"Проживание. Страна 2",212,{"$f":"IF(E12=\"\",\"\",IF(COUNTIF(E$4:E12,E12)=1,MAX(D$4:D11)+1,\"\"))","v":""},{"$f":"IF(Записка!B21=\"\",\"\",VLOOKUP(Записка!B21,Списки!F$2:H$214,2,FALSE))","v":""},{"$f":"IF(E12=\"\",\"\",IF(OR(Записка!B$36=Списки!L26,Записка!C$36=Списки!L14,Записка!C$36=Списки!L15,Записка!C$36=Списки!L16,Записка!C$36=Списки!L17,Записка!C$36=Списки!L18,Записка!C$36=Списки!L19),0,VLOOKUP(Записка!B21,Списки!F$2:H$214,3,0)))","v":""},{"$f":"IF(E12=\"\",\"\",IF(E13=\"\",Записка!F21-1,Записка!F21))","v":""},{"$f":"IF(F12=\"\",0,F12*G12)","v":0}]
[null,"Проживание. Страна 3",212,{"$f":"IF(E13=\"\",\"\",IF(COUNTIF(E$4:E13,E13)=1,MAX(D$4:D12)+1,\"\"))","v":""},{"$f":"IF(Записка!B22=\"\",\"\",VLOOKUP(Записка!B22,Списки!F$2:H$214,2,FALSE))","v":""},{"$f":"IF(E13=\"\",\"\",IF(OR(Записка!B$36=Списки!L27,Записка!C$36=Списки!L15,Записка!C$36=Списки!L16,Записка!C$36=Списки!L17,Записка!C$36=Списки!L18,Записка!C$36=Списки!L19,Записка!C$36=Списки!L20),0,VLOOKUP(Записка!B22,Списки!F$2:H$214,3,0)))","v":""},{"$f":"IF(E13=\"\",\"\",Записка!F22-1)","v":""},0]
[6,"Оргвзнос",212,{"$f":"IF(E14=\"\",\"\",IF(COUNTIF(E$4:E14,E14)=1,MAX(D$4:D13)+1,\"\"))","v":""},null,"X","X"]
[7,"Виза",212,{"$f":"IF(E15=\"\",\"\",IF(COUNTIF(E$4:E15,E15)=1,MAX(D$4:D14)+1,\"\"))","v":""},null,"X","X"]
{"$rows_left_out":32}
{"sheet":"Инструкция по заполнению","index":2,"n_rows":34,"n_cols":6,"rows_kept":34,"cut":false,"hidden":false,"merged":[[19,1,19,5],[23,1,25,5],[18,1,18,5],[11,5,13,5],[11,3,11,4],[21,1,21,5],[22,1,22,5],[11,0,13,0],[14,1,14,5],[15,1,15,5],[16,1,16,5],[17,1,17,5],[12,3,13,4],[11,2,13,2],[11,1,13,1],[0,2,0,5],[26,1,26,5],[28,4,28,5],[29,4,29,5],[30,4,30,5],[20,1,20,5],[2,0,2,5],[4,1,4,2],[4,3,10,3],[4,4,10,4],[4,5,10,5],[5,0,7,0],[8,0,10,0],[5,1,7,1],[5,2,7,2],[8,1,10,2]]}
[null,null,"Приложение №1 \nк Положению о служебных командировках НИУ ВШЭ. Часть 3.\nИнструкция по заполнению Служебной записки о командировании."]
[]
["Служебная записка о командировании"]
[]
["ФИО (полностью) в именительном падеже","Заполняется полностью в именительном падеже ",null,"Дата начала командировки","Дата окончания командировки","Продолжительность командировки, дней"]
["Наименование структурного подразделения (выберите из списка нажатием стрелки у правой ячейки)","Если работник работает в нескольких подразделениях, указываются все подразделения. Первым указывается подразделение, где работник занимает основную ставку","Учетный шифр присваивается автоматически при выборе подразделения из списка"]
[]
[]
["Должность (выберите из списка)","Если работник работает в нескольких подразделениях, указываются все должности, занимаемые в соответствующих подразделениях. Последовательность указания должностей должна совпадать с последовательностью подразделений"]
[]
[]
["Страна (выберите из списка)/Город","Указывается страна/страны командирования. Каждая страна - в отдельной ячейке. Внимание: для Великобритании, США и стран СНГ и Балтии для отдельных городов существуют свои нормы на оплату проживания. При выборе таких стран из списка обращайте внимание - если указан город, то для него существуют отдельные нормы","Если в одной стране посещается несколько городов, то в каждой строке указывается одна и та же страна, но разные города","вводится в формате ДД.ММ.201Г. Даты должны быть определены с учетом дороги",null,"Расссчитывается автоматически"]
[null,null,null,"дата продолжения командировки не может быть ранее окончания даты окончания командировки в предшествующем городе/стране"]
[]
["Организация","Указывается принимающая организация"]
{"$rows_left_out":20}
{"sheet":"Списки","index":3,"n_rows":281,"n_cols":35,"rows_kept":281,"cut":false,"hidden":true,"merged":[[0,6,0,7],[0,23,0,24]]}
["Наименование подразделения","Учетный шифр",null,"Должность",null,"Страна","Предельная норма возмещения по проживанию",null,null,"Основание для командировки",null,"Оплата принимающей стороны","Российская Федерация","За границей",null,"Валюта",null,"Код мероприятия ДК",null,"Направление расходования средств субсидии",null,null,"Страна","Предельная норма возмещения по суточным",null,null,"Валюта суточных",null,"Степень участия",null,"Тип мобильности",null,"Тип мероприятия",null,"Направление"]
[null,null,null,"Агент по снабжению",null,"Российская Федерация","Рубли",2500,null,"Выписка из протокола заседания Бюро Совета Программы \"Научный фонд\"",null,"Нет",1,1,null,"Рубли",null,null,null,null,null,null,"Российская Федерация","Рубли",700,null,"Рубли",null,"Преподаватель",null,"научные мероприятия",null,"Программа двух дипломов",null,"Матем. и естественные науки"]
[null,null,null,"Администратор",null,"Абхазия","Доллары США  ",95,null,"Выписка из протокола заседания Комиссии по отбору заявок на поддержку и развитие международных научных партнёрств",null,"Все расходы",0,0,null,"Английские фунты стерлинги",null,"1.1.1. Создание и поддержка центров передовых исследований и международных лабораторий",null,"1. Реализация мер по формированию кадрового резерва руководящего состава вузов и привлечению на руководящие должности специалистов, имеющих опыт работы в ведущих иностранных и российских университетах и научных организациях;",null,null,"Абхазия","Доллары США  ",54,null,"Доллары США  ",null,"Докладчик",null,"экспертиза/аккредитация образовательных продуктов",null,"Программа обмена",null,"Компьютерные науки"]
[null,null,null,"Администратор дежурный",null,"Австралия","Доллары США  ",130,null,"Выписка из протокола заседания научной комиссии",null,"Виза",0,0,null,"Датские кроны",null,"1.1.2. Развитие центров перспективных исследований по актуальным научным направлениям",null,"2.  Реализация мер по привлечению в вузы молодых научно-педагогических работников, имеющих опыт работы в научно-исследовательской и образовательной сферах в ведущих иностранных и российских университетах и научных организациях;",null,null,"Австралия","Доллары США  ",60,null,null,null,"Исследователь",null,"исследования",null,"Образовательная стажировка / практика",null,"Технические науки"]
[null,null,null,"Администратор-кассир",null,"Австрия","Доллары США  ",120,null,"Выписка из протокола заседания совета по повышению квалификации",null,"Виза, мед страховка",0,0,null,"Доллары США  ",null,"1.2.1. Развитие фундаментальных и эмпирических научных исследований",null,"3.  Реализация программ международной и внутрироссийской академической мобильности научно-педагогических работников в форме стажировок, повышения квалификации, профессиональной переподготовки и в других формах;",null,null,"Австрия","Доллары США  ",66,null,null,null,"Эксперт / Консультант",null,"экспертиза научных исследований",null,"Курс лекций",null,"Сельское хозяйство"]
[null,null,null,"Аналитик",null,"Азербайджан (Баку)","Доллары США  ",75,null,"Иное",null,"Виза, трансфер",0,0,null,"Евро         ",null,"1.2.2. Организация прикладных научных исследований в интересах власти, бизнеса и расширение участия в грантовых программах",null,"4. Реализация мер по совершенствованию деятельности аспирантуры и докторантуры;",null,null,"Азербайджан (Баку)","Доллары США  ",57,null,null,null,"Участник / Слушатель",null,"стажировка",null,"Научно-образовательная школа",null,"Медицинские науки"]
[null,null,null,"Аналитик 1 категории",null,"Азербайджан","Доллары США  ",60,null,"Письменное распоряжение руководителя",null,"Медицинская страховка",0,0,null,"Норвежские кроны",null,"1.2.3. Мониторинг и форсайт перспективных рынков и областей прикладных научных исследований и разработок",null,"5. Реализация мер по поддержке студентов, аспирантов, стажеров, молодых научно-педагогических работников;",null,null,"Азербайджан ","Доллары США  ",57,null,null,null,"Организатор / Модератор",null,"повышение квалификации",null,"Повышение квалификации",null,"Искусство и культура"]
[null,null,null,"Архивариус",null,"Албания","Доллары США  ",150,null,"План работы факультета/кафедры",null,"Проезд",0,0,null,"Шведские  кроны",null,"1.2.4. Развитие прикладных научных исследований и разработок в интересах Администрации Президента и Правительства Российской Федерации",null,"6. Внедрение в вузах новых образовательных программ совместно с ведущими иностранными и российскими университетами и научными организациями;",null,null,"Албания","Доллары США  ",67,null,null,null,"Иное",null,"профессиональная переподготовка",null,"Профессиональная переподготовка",null,"Гуманитарные науки"]
[null,null,null,"Ассистент",null,"Алжир","Доллары США  ",85,null,"Приглашение",null,"Проезд, виза",0,0,null,"Швейцарские  франки     ",null,"1.2.5. Поддержка развития  международных научных партнерств",null,"7. Осуществление мер по привлечению студентов из ведущих иностранных университетов для обучения в российских вузах, в том числе путем реализации партнерских образовательных программ с иностранными университетами и ассоциациями университетов;",null,null,"Алжир","Доллары США  ",65,null,null,null,null,null,"образовательные мероприятия",null,"Конкурс / олимпиада",null,"Психология"]
[null,null,null,"Ассистент звукорежиссера",null,"Ангола","Доллары США  ",140,null,"Устное распоряжение руководителя",null,"Проезд, мед страховка",0,0,null,"Японские иены ",null,"1.3.1. Развитие системы международной экспертизы исследовательских проектов и научных коллективов",null,"8. Реализация в рамках планов проведения научно-исследовательских работ в соответствии с программой фундаментальных научных исследований в Российской Федерации на долгосрочный период в вузах, а также с учетом приоритетных международных направлений фундаментальных и прикладных исследований:",null,null,"Ангола","Доллары США  ",80,null,null,null,null,null,"организация партнерств",null,"Однодневное образовательное мероприятие",null,"Педагогика"]
[null,null,null,"Бармен",null,"Андорра","Евро         ",140,null,null,null,"Проезд, суточные",0,0,null,null,null,"1.3.2. Развитие системы лингвистической поддержки публикаций на иностранном языке",null,"8.1. Научно-исследовательских проектов с привлечением к руководству ведущих иностранных и российских ученых и (или) совместно с перспективными научными организациями, в том числе с возможностью создания структурных подразделений в вузах;",null,null,"Андорра","Доллары США  ",62,null,null,null,null,null,"продвижение ВШЭ",null,"Исследования / научные проекты",null,"Социальные науки"]
[null,null,null,"Библиограф",null,"Антигуа и Барбуда","Доллары США  ",100,null,null,null,"Проезд, трансфер",0,0,null,null,null,"1.3.3. Вывод журналов ВШЭ на глобальный рынок",null,"8.2.Научно-исследовательских и опытно-конструкторских проектов совместно с российскими и международными высокотехнологичными организациями, в том числе с возможностью создания структурных подразделений в вузах",null,null,"Антигуа и Барбуда","Доллары США  ",69,null,null,null,null,null,"Рабочая встреча",null,"Научная стажировка / практика",null,"Экономика и бизнес"]
[null,null,null,"Библиограф 1 категории",null,"Аргентина","Доллары США  ",130,null,null,null,"Проживание",0,0,null,null,null,"1.3.4. Продвижение бренда Университета в целях повышения его узнаваемости в качестве международного научного центра среди широкой общественности",null,null,null,null,"Аргентина","Доллары США  ",64,null,null,null,null,null,"Служебное задание",null,"Научная конференция и ее аналоги"]
[null,null,null,"Библиотекарь",null,"Армения (Ереван)","Доллары США  ",110,null,null,null,"Проживание, виза",0,0,null,null,null,"1.4.1. Развитие системы профессионализации менеджмента научных исследований",null,null,null,null,"Армения (Ереван)","Доллары США  ",57,null,null,null,null,null,null,null,"Экспертиза / экспертный совет"]
[null,null,null,"Библиотекарь 1 категории",null,"Армения","Доллары США  ",80,null,"Курсы валют ЦБ","Рублей/ед валюты","Проживание, мед страховка",0,0,null,null,null,"1.4.2. Развитие системы эффективной оценки публикационной активности научно-педагогических работников ВШЭ",null,null,null,null,"Армения","Доллары США  ",57,null,null,null,null,null,null,null,"Однодневное научное мероприятие"]
{"$rows_left_out":267}
{"sheet":"Согласование ЦБ","index":4,"n_rows":25,"n_cols":6,"rows_kept":25,"cut":false,"hidden":true,"merged":[[0,0,0,5]]}
["Перечень направлений командировочных расходов, курируемых отделом централизованных ресурсов ПФУ"]
[]
["статьи расходов ИС-ПРО","статьи расходов ФАС","Строка ФП (статьи расходов ЦБ)","статьи расходов","Куратор подразделений","Куратор ПФУ"]
[1103060,22010200,"Проведение конференций и семинаров","Проведение конференций и семинаров","Радаев В.В./Григорьева Е.А.","Афанасьева А.Н."]
[1304000,27020000,"Резерв ректора","Резерв ректора","Кузьминов Я.И.","Афанасьева А.Н."]
[1900030,21010500,"Мероприятия программы \"Кадровый резерв\"","Стажировка и повышение квалификации сотрудников ВШЭ на базе ведущих зарубежных университетов","Юдкевич М.М./Гришина А.В.","Афанасьева А.Н."]
[1900401,22020810,"Многопрофильные олимпиады школьников","Многопрофильная олимпиада школьников","Башев В.В./Протасевич Т.А.","Афанасьева А.Н."]
[1900402,22020830,"Прочие олимпиады","Олимпиада для студентов и выпускников вузов России и стран СНГ","Башев В.В./Протасевич Т.А.","Афанасьева А.Н."]
[1900440,22020300,"Мероприятия Управления по сотрудничеству со странами СНГ и Балтии","Проведение в странах СНГ и Центральной и Восточной Европы конкурсного отбора на места, обеспеченные государственным финансированием (квотного отбора), олимпиад и пр.","Ерофеев С.А./Четвернина Т.Я.","Афанасьева А.Н."]
[1900441,22020600,"Партнерства ВШЭ с региональными центрами, образовательными учреждениями, вузами России","Профориентационная работа в регионах РФ (командировки в вузы, школы, региональные департаменты образования, участие  в проведении летних региональных школ для одаренных школьников   и др.)","Башев В.В./Протасевич Т.А.","Афанасьева А.Н."]
[2500000,21050200,"Мероприятия Бизнес-инкубатора","Мероприятия Бизнес-инкубатора, Управление инновационной деятельности","Новосельцев А.В. /Суворова Н.И.","Афанасьева А.Н."]
[1104000,25020201,"Командировки и служебные разъезды","Командировки и служебные разъезды","Новосельцев А.В. / командировки за счет средств центрального бюджета","Кирсенкова Н.А."]
[1111040,21012500,"ПОВЫШЕНИЕ КВАЛИФИКАЦИИ РАБОТНИКОВ УНИВЕРСИТЕТА","Формирование группы участников программы Кадрового административного резерва","Ерофеев С.А./Гринкевич Ю.В.","Кирсенкова Н.А."]
[1900180,21040400,"Организация международного рекрутинга и поддержка академической мобильности международных специалистов PhD и пост-доков","Программа исходящей академической мобильности международных специалистов PhD","Радаев В.В./Медведева М.В.","Кирсенкова Н.А."]
[1900290,21030400,"Развитие международных партнерств и продвижение участия НИУ ВШЭ в деятельности ассоциаций и сетей","Развитие институциональных партнерств с ведущими международными научно-образовательными центрами","Ерофеев С.А./Баталина М.Л.","Кирсенкова Н.А."]
{"$rows_left_out":11}
{"sheet":"Структура","index":5,"n_rows":314,"n_cols":3,"rows_kept":314,"cut":false,"hidden":true,"merged":[]}
["Наименование подразделения","Шифр подразделения","Укрупненный шифр"]
[]
["\r\n\r\nУправление общего образования","01.98","01.98"]
["\"Программа \"\"Научный фонд ГУ-ВШЭ\"\"\"","11.12"]
["\"Проект \"\"Социологические и маркетинговые исслед.\"\"\"","11.03"]
["\"Проекты \"\"Учитель-ученик\"\"\"","11.12.04"]
["1-ый отдел","01.31","01.31"]
["PR мероприятия","11.19"]
["Аналитический центр","01.72","01.72"]
["Антикоррупционный центр","05.66","05.66"]
["архитектурное бюро","05.63.04","05.63"]
["базовая кафедра \"Интеллектуальные технологии системного анализа и управления\" Федерального исследовательского центра \"Информатика и управление\" Российской академии наук (ФИЦ ИУ РАН)","02.26.10","02.26"]
["базовая кафедра \"Системное программирование\" Института системного программирования РАН","02.26.01.01","02.26"]
["базовая кафедра компании SAS","02.26.17","02.26"]
["базовая кафедра компании МакКинзи и Ко","02.12.05","02.12"]
{"$rows_left_out":300}
{"sheet":"Должности","index":6,"n_rows":627,"n_cols":2,"rows_kept":627,"cut":false,"hidden":true,"merged":[]}
["Наименование должности","Код должности"]
[]
["Агент коммерческий",932]
["Агент по снабжению",963]
["Агент торговый",10052]
["Административный директор",56]
["Администратор-кассир",1051]
["Администратор",885]
["Администратор дежурной службы охраны",1144]
["Администратор дежурный",996]
["Аналитик",961]
["Аналитик 1 категории",10030]
["Архивариус",1021]
["Архитектор",10085]
["Ассистент",602]
{"$rows_left_out":612}